{"text_format":"1","workbook":"xlsx","n_sheets":6,"sheets":["Fördergruppen","Gegenstand","Klasse","Raum","Lehrer","Datum"],"not_rendered":{"charts":0,"images":0,"macros":1,"external_links":0,"defined_names":0,"comments":0,"pivot_tables":0},"unopened":[],"bounds":{"document_bytes":16777216,"sheet_cells":100000,"rows_first":2000,"rows_last":500,"rows_between":2000,"halvings":0,"cell_chars":16384,"cell_head_chars":4096},"cells_cut":0,"cells_raw":0,"read":"whole","date_system":"1900"}

{"sheet":"Fördergruppen","index":0,"n_rows":301,"n_cols":17,"rows_kept":301,"cut":false,"hidden":false,"merged":[]}
[]
[null,"Typ","Lehrer","Lehrer_ID","Gegenstand","GA_FA_ID","GA_ID","FA_ID","Gruppenbezeichnung kurz","Gruppenbezeichnung lang","Von","Bis","Anzahl Stunden","Klassen","Raum","RA_ID","Termine anlegen"]
[null,"Gruppe",null,{"$f":"IFERROR(VLOOKUP(C3,Lehrer!$C$1:$N$100,9,TRUE),\"\")","v":""},null,{"$f":"IFERROR(VLOOKUP(E3,Gegenstand!$B$1:$E$400,4,TRUE),\"\")","v":""},{"$f":"IFERROR(LEFT(F3,FIND(\"#\",F3)-1),\"\")","v":""},{"$f":"IFERROR(RIGHT(F3,LEN(F3)-FIND(\"#\",F3)),\"\")","v":""},null,null,"2017-09-11","2018-07-06",null,null,null,{"$f":"IFERROR(VLOOKUP(O3,Raum!$B$1:$E$400,4,TRUE),\"\")","v":""},"Ja"]
[null,"Gruppe",null,{"$f":"IFERROR(VLOOKUP(C4,Lehrer!$C$1:$N$100,9,TRUE),\"\")","v":""},null,{"$f":"IFERROR(VLOOKUP(E4,Gegenstand!$B$1:$E$400,4,TRUE),\"\")","v":""},{"$f":"IFERROR(LEFT(F4,FIND(\"#\",F4)-1),\"\")","v":""},{"$f":"IFERROR(RIGHT(F4,LEN(F4)-FIND(\"#\",F4)),\"\")","v":""},null,null,null,null,null,null,null,{"$f":"IFERROR(VLOOKUP(O4,Raum!$B$1:$E$400,4,TRUE),\"\")","v":""}]
[null,"Gruppe",null,{"$f":"IFERROR(VLOOKUP(C5,Lehrer!$C$1:$N$100,9,TRUE),\"\")","v":""},null,{"$f":"IFERROR(VLOOKUP(E5,Gegenstand!$B$1:$E$400,4,TRUE),\"\")","v":""},"","",null,null,null,null,null,null,null,{"$f":"IFERROR(VLOOKUP(O5,Raum!$B$1:$E$400,4,TRUE),\"\")","v":""}]
[null,"Gruppe",null,{"$f":"IFERROR(VLOOKUP(C6,Lehrer!$C$1:$N$100,9,TRUE),\"\")","v":""},null,{"$f":"IFERROR(VLOOKUP(E6,Gegenstand!$B$1:$E$400,4,TRUE),\"\")","v":""},"","",null,null,null,null,null,null,null,{"$f":"IFERROR(VLOOKUP(O6,Raum!$B$1:$E$400,4,TRUE),\"\")","v":""}]
[null,"Gruppe",null,{"$f":"IFERROR(VLOOKUP(C7,Lehrer!$C$1:$N$100,9,TRUE),\"\")","v":""},null,{"$f":"IFERROR(VLOOKUP(E7,Gegenstand!$B$1:$E$400,4,TRUE),\"\")","v":""},"","",null,null,null,null,null,null,null,{"$f":"IFERROR(VLOOKUP(O7,Raum!$B$1:$E$400,4,TRUE),\"\")","v":""}]
[null,"Gruppe",null,{"$f":"IFERROR(VLOOKUP(C8,Lehrer!$C$1:$N$100,9,TRUE),\"\")","v":""},null,{"$f":"IFERROR(VLOOKUP(E8,Gegenstand!$B$1:$E$400,4,TRUE),\"\")","v":""},"","",null,null,null,null,null,null,null,{"$f":"IFERROR(VLOOKUP(O8,Raum!$B$1:$E$400,4,TRUE),\"\")","v":""}]
[null,"Gruppe",null,{"$f":"IFERROR(VLOOKUP(C9,Lehrer!$C$1:$N$100,9,TRUE),\"\")","v":""},null,{"$f":"IFERROR(VLOOKUP(E9,Gegenstand!$B$1:$E$400,4,TRUE),\"\")","v":""},"","",null,null,null,null,null,null,null,{"$f":"IFERROR(VLOOKUP(O9,Raum!$B$1:$E$400,4,TRUE),\"\")","v":""}]
[null,"Gruppe",null,{"$f":"IFERROR(VLOOKUP(C10,Lehrer!$C$1:$N$100,9,TRUE),\"\")","v":""},null,{"$f":"IFERROR(VLOOKUP(E10,Gegenstand!$B$1:$E$400,4,TRUE),\"\")","v":""},"","",null,null,null,null,null,null,null,{"$f":"IFERROR(VLOOKUP(O10,Raum!$B$1:$E$400,4,TRUE),\"\")","v":""}]
[null,"Gruppe",null,{"$f":"IFERROR(VLOOKUP(C11,Lehrer!$C$1:$N$100,9,TRUE),\"\")","v":""},null,{"$f":"IFERROR(VLOOKUP(E11,Gegenstand!$B$1:$E$400,4,TRUE),\"\")","v":""},"","",null,null,null,null,null,null,null,{"$f":"IFERROR(VLOOKUP(O11,Raum!$B$1:$E$400,4,TRUE),\"\")","v":""}]
[null,"Gruppe",null,{"$f":"IFERROR(VLOOKUP(C12,Lehrer!$C$1:$N$100,9,TRUE),\"\")","v":""},null,{"$f":"IFERROR(VLOOKUP(E12,Gegenstand!$B$1:$E$400,4,TRUE),\"\")","v":""},"","",null,null,null,null,null,null,null,{"$f":"IFERROR(VLOOKUP(O12,Raum!$B$1:$E$400,4,TRUE),\"\")","v":""}]
[null,"Gruppe",null,{"$f":"IFERROR(VLOOKUP(C13,Lehrer!$C$1:$N$100,9,TRUE),\"\")","v":""},null,{"$f":"IFERROR(VLOOKUP(E13,Gegenstand!$B$1:$E$400,4,TRUE),\"\")","v":""},"","",null,null,null,null,null,null,null,{"$f":"IFERROR(VLOOKUP(O13,Raum!$B$1:$E$400,4,TRUE),\"\")","v":""}]
[null,"Gruppe",null,{"$f":"IFERROR(VLOOKUP(C14,Lehrer!$C$1:$N$100,9,TRUE),\"\")","v":""},null,{"$f":"IFERROR(VLOOKUP(E14,Gegenstand!$B$1:$E$400,4,TRUE),\"\")","v":""},"","",null,null,null,null,null,null,null,{"$f":"IFERROR(VLOOKUP(O14,Raum!$B$1:$E$400,4,TRUE),\"\")","v":""}]
[null,"Gruppe",null,{"$f":"IFERROR(VLOOKUP(C15,Lehrer!$C$1:$N$100,9,TRUE),\"\")","v":""},null,{"$f":"IFERROR(VLOOKUP(E15,Gegenstand!$B$1:$E$400,4,TRUE),\"\")","v":""},"","",null,null,null,null,null,null,null,{"$f":"IFERROR(VLOOKUP(O15,Raum!$B$1:$E$400,4,TRUE),\"\")","v":""}]
[null,"Gruppe",null,{"$f":"IFERROR(VLOOKUP(C16,Lehrer!$C$1:$N$100,9,TRUE),\"\")","v":""},null,{"$f":"IFERROR(VLOOKUP(E16,Gegenstand!$B$1:$E$400,4,TRUE),\"\")","v":""},"","",null,null,null,null,null,null,null,{"$f":"IFERROR(VLOOKUP(O16,Raum!$B$1:$E$400,4,TRUE),\"\")","v":""}]
[null,"Gruppe",null,{"$f":"IFERROR(VLOOKUP(C17,Lehrer!$C$1:$N$100,9,TRUE),\"\")","v":""},null,{"$f":"IFERROR(VLOOKUP(E17,Gegenstand!$B$1:$E$400,4,TRUE),\"\")","v":""},"","",null,null,null,null,null,null,null,{"$f":"IFERROR(VLOOKUP(O17,Raum!$B$1:$E$400,4,TRUE),\"\")","v":""}]
[null,"Gruppe",null,{"$f":"IFERROR(VLOOKUP(C18,Lehrer!$C$1:$N$100,9,TRUE),\"\")","v":""},null,{"$f":"IFERROR(VLOOKUP(E18,Gegenstand!$B$1:$E$400,4,TRUE),\"\")","v":""},"","",null,null,null,null,null,null,null,{"$f":"IFERROR(VLOOKUP(O18,Raum!$B$1:$E$400,4,TRUE),\"\")","v":""}]
[null,"Gruppe",null,{"$f":"IFERROR(VLOOKUP(C19,Lehrer!$C$1:$N$100,9,TRUE),\"\")","v":""},null,{"$f":"IFERROR(VLOOKUP(E19,Gegenstand!$B$1:$E$400,4,TRUE),\"\")","v":""},"","",null,null,null,null,null,null,null,{"$f":"IFERROR(VLOOKUP(O19,Raum!$B$1:$E$400,4,TRUE),\"\")","v":""}]
[null,"Gruppe",null,{"$f":"IFERROR(VLOOKUP(C20,Lehrer!$C$1:$N$100,9,TRUE),\"\")","v":""},null,{"$f":"IFERROR(VLOOKUP(E20,Gegenstand!$B$1:$E$400,4,TRUE),\"\")","v":""},"","",null,null,null,null,null,null,null,{"$f":"IFERROR(VLOOKUP(O20,Raum!$B$1:$E$400,4,TRUE),\"\")","v":""}]
[null,"Gruppe",null,{"$f":"IFERROR(VLOOKUP(C21,Lehrer!$C$1:$N$100,9,TRUE),\"\")","v":""},null,{"$f":"IFERROR(VLOOKUP(E21,Gegenstand!$B$1:$E$400,4,TRUE),\"\")","v":""},"","",null,null,null,null,null,null,null,{"$f":"IFERROR(VLOOKUP(O21,Raum!$B$1:$E$400,4,TRUE),\"\")","v":""}]
[null,"Gruppe",null,{"$f":"IFERROR(VLOOKUP(C22,Lehrer!$C$1:$N$100,9,TRUE),\"\")","v":""},null,{"$f":"IFERROR(VLOOKUP(E22,Gegenstand!$B$1:$E$400,4,TRUE),\"\")","v":""},"","",null,null,null,null,null,null,null,{"$f":"IFERROR(VLOOKUP(O22,Raum!$B$1:$E$400,4,TRUE),\"\")","v":""}]
[null,"Gruppe",null,{"$f":"IFERROR(VLOOKUP(C23,Lehrer!$C$1:$N$100,9,TRUE),\"\")","v":""},null,{"$f":"IFERROR(VLOOKUP(E23,Gegenstand!$B$1:$E$400,4,TRUE),\"\")","v":""},"","",null,null,null,null,null,null,null,{"$f":"IFERROR(VLOOKUP(O23,Raum!$B$1:$E$400,4,TRUE),\"\")","v":""}]
[null,"Gruppe",null,{"$f":"IFERROR(VLOOKUP(C24,Lehrer!$C$1:$N$100,9,TRUE),\"\")","v":""},null,{"$f":"IFERROR(VLOOKUP(E24,Gegenstand!$B$1:$E$400,4,TRUE),\"\")","v":""},"","",null,null,null,null,null,null,null,{"$f":"IFERROR(VLOOKUP(O24,Raum!$B$1:$E$400,4,TRUE),\"\")","v":""}]
[null,"Gruppe",null,{"$f":"IFERROR(VLOOKUP(C25,Lehrer!$C$1:$N$100,9,TRUE),\"\")","v":""},null,{"$f":"IFERROR(VLOOKUP(E25,Gegenstand!$B$1:$E$400,4,TRUE),\"\")","v":""},"","",null,null,null,null,null,null,null,{"$f":"IFERROR(VLOOKUP(O25,Raum!$B$1:$E$400,4,TRUE),\"\")","v":""}]
[null,"Gruppe",null,{"$f":"IFERROR(VLOOKUP(C26,Lehrer!$C$1:$N$100,9,TRUE),\"\")","v":""},null,{"$f":"IFERROR(VLOOKUP(E26,Gegenstand!$B$1:$E$400,4,TRUE),\"\")","v":""},"","",null,null,null,null,null,null,null,{"$f":"IFERROR(VLOOKUP(O26,Raum!$B$1:$E$400,4,TRUE),\"\")","v":""}]
[null,"Gruppe",null,{"$f":"IFERROR(VLOOKUP(C27,Lehrer!$C$1:$N$100,9,TRUE),\"\")","v":""},null,{"$f":"IFERROR(VLOOKUP(E27,Gegenstand!$B$1:$E$400,4,TRUE),\"\")","v":""},"","",null,null,null,null,null,null,null,{"$f":"IFERROR(VLOOKUP(O27,Raum!$B$1:$E$400,4,TRUE),\"\")","v":""}]
[null,"Gruppe",null,{"$f":"IFERROR(VLOOKUP(C28,Lehrer!$C$1:$N$100,9,TRUE),\"\")","v":""},null,{"$f":"IFERROR(VLOOKUP(E28,Gegenstand!$B$1:$E$400,4,TRUE),\"\")","v":""},"","",null,null,null,null,null,null,null,{"$f":"IFERROR(VLOOKUP(O28,Raum!$B$1:$E$400,4,TRUE),\"\")","v":""}]
[null,"Gruppe",null,{"$f":"IFERROR(VLOOKUP(C29,Lehrer!$C$1:$N$100,9,TRUE),\"\")","v":""},null,{"$f":"IFERROR(VLOOKUP(E29,Gegenstand!$B$1:$E$400,4,TRUE),\"\")","v":""},"","",null,null,null,null,null,null,null,{"$f":"IFERROR(VLOOKUP(O29,Raum!$B$1:$E$400,4,TRUE),\"\")","v":""}]
[null,"Gruppe",null,{"$f":"IFERROR(VLOOKUP(C30,Lehrer!$C$1:$N$100,9,TRUE),\"\")","v":""},null,{"$f":"IFERROR(VLOOKUP(E30,Gegenstand!$B$1:$E$400,4,TRUE),\"\")","v":""},"","",null,null,null,null,null,null,null,{"$f":"IFERROR(VLOOKUP(O30,Raum!$B$1:$E$400,4,TRUE),\"\")","v":""}]
[null,"Gruppe",null,{"$f":"IFERROR(VLOOKUP(C31,Lehrer!$C$1:$N$100,9,TRUE),\"\")","v":""},null,{"$f":"IFERROR(VLOOKUP(E31,Gegenstand!$B$1:$E$400,4,TRUE),\"\")","v":""},"","",null,null,null,null,null,null,null,{"$f":"IFERROR(VLOOKUP(O31,Raum!$B$1:$E$400,4,TRUE),\"\")","v":""}]
[null,"Gruppe",null,{"$f":"IFERROR(VLOOKUP(C32,Lehrer!$C$1:$N$100,9,TRUE),\"\")","v":""},null,{"$f":"IFERROR(VLOOKUP(E32,Gegenstand!$B$1:$E$400,4,TRUE),\"\")","v":""},"","",null,null,null,null,null,null,null,{"$f":"IFERROR(VLOOKUP(O32,Raum!$B$1:$E$400,4,TRUE),\"\")","v":""}]
[null,"Gruppe",null,{"$f":"IFERROR(VLOOKUP(C33,Lehrer!$C$1:$N$100,9,TRUE),\"\")","v":""},null,{"$f":"IFERROR(VLOOKUP(E33,Gegenstand!$B$1:$E$400,4,TRUE),\"\")","v":""},"","",null,null,null,null,null,null,null,{"$f":"IFERROR(VLOOKUP(O33,Raum!$B$1:$E$400,4,TRUE),\"\")","v":""}]
[null,"Gruppe",null,{"$f":"IFERROR(VLOOKUP(C34,Lehrer!$C$1:$N$100,9,TRUE),\"\")","v":""},null,{"$f":"IFERROR(VLOOKUP(E34,Gegenstand!$B$1:$E$400,4,TRUE),\"\")","v":""},"","",null,null,null,null,null,null,null,{"$f":"IFERROR(VLOOKUP(O34,Raum!$B$1:$E$400,4,TRUE),\"\")","v":""}]
[null,"Gruppe",null,{"$f":"IFERROR(VLOOKUP(C35,Lehrer!$C$1:$N$100,9,TRUE),\"\")","v":""},null,{"$f":"IFERROR(VLOOKUP(E35,Gegenstand!$B$1:$E$400,4,TRUE),\"\")","v":""},"","",null,null,null,null,null,null,null,{"$f":"IFERROR(VLOOKUP(O35,Raum!$B$1:$E$400,4,TRUE),\"\")","v":""}]
[null,"Gruppe",null,{"$f":"IFERROR(VLOOKUP(C36,Lehrer!$C$1:$N$100,9,TRUE),\"\")","v":""},null,{"$f":"IFERROR(VLOOKUP(E36,Gegenstand!$B$1:$E$400,4,TRUE),\"\")","v":""},"","",null,null,null,null,null,null,null,{"$f":"IFERROR(VLOOKUP(O36,Raum!$B$1:$E$400,4,TRUE),\"\")","v":""}]
[null,"Gruppe",null,{"$f":"IFERROR(VLOOKUP(C37,Lehrer!$C$1:$N$100,9,TRUE),\"\")","v":""},null,{"$f":"IFERROR(VLOOKUP(E37,Gegenstand!$B$1:$E$400,4,TRUE),\"\")","v":""},"","",null,null,null,null,null,null,null,{"$f":"IFERROR(VLOOKUP(O37,Raum!$B$1:$E$400,4,TRUE),\"\")","v":""}]
[null,"Gruppe",null,{"$f":"IFERROR(VLOOKUP(C38,Lehrer!$C$1:$N$100,9,TRUE),\"\")","v":""},null,{"$f":"IFERROR(VLOOKUP(E38,Gegenstand!$B$1:$E$400,4,TRUE),\"\")","v":""},"","",null,null,null,null,null,null,null,{"$f":"IFERROR(VLOOKUP(O38,Raum!$B$1:$E$400,4,TRUE),\"\")","v":""}]
[null,"Gruppe",null,{"$f":"IFERROR(VLOOKUP(C39,Lehrer!$C$1:$N$100,9,TRUE),\"\")","v":""},null,{"$f":"IFERROR(VLOOKUP(E39,Gegenstand!$B$1:$E$400,4,TRUE),\"\")","v":""},"","",null,null,null,null,null,null,null,{"$f":"IFERROR(VLOOKUP(O39,Raum!$B$1:$E$400,4,TRUE),\"\")","v":""}]
[null,"Gruppe",null,{"$f":"IFERROR(VLOOKUP(C40,Lehrer!$C$1:$N$100,9,TRUE),\"\")","v":""},null,{"$f":"IFERROR(VLOOKUP(E40,Gegenstand!$B$1:$E$400,4,TRUE),\"\")","v":""},"","",null,null,null,null,null,null,null,{"$f":"IFERROR(VLOOKUP(O40,Raum!$B$1:$E$400,4,TRUE),\"\")","v":""}]
[null,"Gruppe",null,{"$f":"IFERROR(VLOOKUP(C41,Lehrer!$C$1:$N$100,9,TRUE),\"\")","v":""},null,{"$f":"IFERROR(VLOOKUP(E41,Gegenstand!$B$1:$E$400,4,TRUE),\"\")","v":""},"","",null,null,null,null,null,null,null,{"$f":"IFERROR(VLOOKUP(O41,Raum!$B$1:$E$400,4,TRUE),\"\")","v":""}]
[null,"Gruppe",null,{"$f":"IFERROR(VLOOKUP(C42,Lehrer!$C$1:$N$100,9,TRUE),\"\")","v":""},null,{"$f":"IFERROR(VLOOKUP(E42,Gegenstand!$B$1:$E$400,4,TRUE),\"\")","v":""},"","",null,null,null,null,null,null,null,{"$f":"IFERROR(VLOOKUP(O42,Raum!$B$1:$E$400,4,TRUE),\"\")","v":""}]
[null,"Gruppe",null,{"$f":"IFERROR(VLOOKUP(C43,Lehrer!$C$1:$N$100,9,TRUE),\"\")","v":""},null,{"$f":"IFERROR(VLOOKUP(E43,Gegenstand!$B$1:$E$400,4,TRUE),\"\")","v":""},"","",null,null,null,null,null,null,null,{"$f":"IFERROR(VLOOKUP(O43,Raum!$B$1:$E$400,4,TRUE),\"\")","v":""}]
[null,"Gruppe",null,{"$f":"IFERROR(VLOOKUP(C44,Lehrer!$C$1:$N$100,9,TRUE),\"\")","v":""},null,{"$f":"IFERROR(VLOOKUP(E44,Gegenstand!$B$1:$E$400,4,TRUE),\"\")","v":""},"","",null,null,null,null,null,null,null,{"$f":"IFERROR(VLOOKUP(O44,Raum!$B$1:$E$400,4,TRUE),\"\")","v":""}]
[null,"Gruppe",null,{"$f":"IFERROR(VLOOKUP(C45,Lehrer!$C$1:$N$100,9,TRUE),\"\")","v":""},null,{"$f":"IFERROR(VLOOKUP(E45,Gegenstand!$B$1:$E$400,4,TRUE),\"\")","v":""},"","",null,null,null,null,null,null,null,{"$f":"IFERROR(VLOOKUP(O45,Raum!$B$1:$E$400,4,TRUE),\"\")","v":""}]
[null,"Gruppe",null,{"$f":"IFERROR(VLOOKUP(C46,Lehrer!$C$1:$N$100,9,TRUE),\"\")","v":""},null,{"$f":"IFERROR(VLOOKUP(E46,Gegenstand!$B$1:$E$400,4,TRUE),\"\")","v":""},"","",null,null,null,null,null,null,null,{"$f":"IFERROR(VLOOKUP(O46,Raum!$B$1:$E$400,4,TRUE),\"\")","v":""}]
[null,"Gruppe",null,{"$f":"IFERROR(VLOOKUP(C47,Lehrer!$C$1:$N$100,9,TRUE),\"\")","v":""},null,{"$f":"IFERROR(VLOOKUP(E47,Gegenstand!$B$1:$E$400,4,TRUE),\"\")","v":""},"","",null,null,null,null,null,null,null,{"$f":"IFERROR(VLOOKUP(O47,Raum!$B$1:$E$400,4,TRUE),\"\")","v":""}]
[null,"Gruppe",null,{"$f":"IFERROR(VLOOKUP(C48,Lehrer!$C$1:$N$100,9,TRUE),\"\")","v":""},null,{"$f":"IFERROR(VLOOKUP(E48,Gegenstand!$B$1:$E$400,4,TRUE),\"\")","v":""},"","",null,null,null,null,null,null,null,{"$f":"IFERROR(VLOOKUP(O48,Raum!$B$1:$E$400,4,TRUE),\"\")","v":""}]
[null,"Gruppe",null,{"$f":"IFERROR(VLOOKUP(C49,Lehrer!$C$1:$N$100,9,TRUE),\"\")","v":""},null,{"$f":"IFERROR(VLOOKUP(E49,Gegenstand!$B$1:$E$400,4,TRUE),\"\")","v":""},"","",null,null,null,null,null,null,null,{"$f":"IFERROR(VLOOKUP(O49,Raum!$B$1:$E$400,4,TRUE),\"\")","v":""}]
[null,"Gruppe",null,{"$f":"IFERROR(VLOOKUP(C50,Lehrer!$C$1:$N$100,9,TRUE),\"\")","v":""},null,{"$f":"IFERROR(VLOOKUP(E50,Gegenstand!$B$1:$E$400,4,TRUE),\"\")","v":""},"","",null,null,null,null,null,null,null,{"$f":"IFERROR(VLOOKUP(O50,Raum!$B$1:$E$400,4,TRUE),\"\")","v":""}]
[null,"Gruppe",null,{"$f":"IFERROR(VLOOKUP(C51,Lehrer!$C$1:$N$100,9,TRUE),\"\")","v":""},null,{"$f":"IFERROR(VLOOKUP(E51,Gegenstand!$B$1:$E$400,4,TRUE),\"\")","v":""},"","",null,null,null,null,null,null,null,{"$f":"IFERROR(VLOOKUP(O51,Raum!$B$1:$E$400,4,TRUE),\"\")","v":""}]
[null,"Gruppe",null,{"$f":"IFERROR(VLOOKUP(C52,Lehrer!$C$1:$N$100,9,TRUE),\"\")","v":""},null,{"$f":"IFERROR(VLOOKUP(E52,Gegenstand!$B$1:$E$400,4,TRUE),\"\")","v":""},"","",null,null,null,null,null,null,null,{"$f":"IFERROR(VLOOKUP(O52,Raum!$B$1:$E$400,4,TRUE),\"\")","v":""}]
[null,"Gruppe",null,{"$f":"IFERROR(VLOOKUP(C53,Lehrer!$C$1:$N$100,9,TRUE),\"\")","v":""},null,{"$f":"IFERROR(VLOOKUP(E53,Gegenstand!$B$1:$E$400,4,TRUE),\"\")","v":""},"","",null,null,null,null,null,null,null,{"$f":"IFERROR(VLOOKUP(O53,Raum!$B$1:$E$400,4,TRUE),\"\")","v":""}]
[null,"Gruppe",null,{"$f":"IFERROR(VLOOKUP(C54,Lehrer!$C$1:$N$100,9,TRUE),\"\")","v":""},null,{"$f":"IFERROR(VLOOKUP(E54,Gegenstand!$B$1:$E$400,4,TRUE),\"\")","v":""},"","",null,null,null,null,null,null,null,{"$f":"IFERROR(VLOOKUP(O54,Raum!$B$1:$E$400,4,TRUE),\"\")","v":""}]
[null,"Gruppe",null,{"$f":"IFERROR(VLOOKUP(C55,Lehrer!$C$1:$N$100,9,TRUE),\"\")","v":""},null,{"$f":"IFERROR(VLOOKUP(E55,Gegenstand!$B$1:$E$400,4,TRUE),\"\")","v":""},"","",null,null,null,null,null,null,null,{"$f":"IFERROR(VLOOKUP(O55,Raum!$B$1:$E$400,4,TRUE),\"\")","v":""}]
[null,"Gruppe",null,{"$f":"IFERROR(VLOOKUP(C56,Lehrer!$C$1:$N$100,9,TRUE),\"\")","v":""},null,{"$f":"IFERROR(VLOOKUP(E56,Gegenstand!$B$1:$E$400,4,TRUE),\"\")","v":""},"","",null,null,null,null,null,null,null,{"$f":"IFERROR(VLOOKUP(O56,Raum!$B$1:$E$400,4,TRUE),\"\")","v":""}]
[null,"Gruppe",null,{"$f":"IFERROR(VLOOKUP(C57,Lehrer!$C$1:$N$100,9,TRUE),\"\")","v":""},null,{"$f":"IFERROR(VLOOKUP(E57,Gegenstand!$B$1:$E$400,4,TRUE),\"\")","v":""},"","",null,null,null,null,null,null,null,{"$f":"IFERROR(VLOOKUP(O57,Raum!$B$1:$E$400,4,TRUE),\"\")","v":""}]
[null,"Gruppe",null,{"$f":"IFERROR(VLOOKUP(C58,Lehrer!$C$1:$N$100,9,TRUE),\"\")","v":""},null,{"$f":"IFERROR(VLOOKUP(E58,Gegenstand!$B$1:$E$400,4,TRUE),\"\")","v":""},"","",null,null,null,null,null,null,null,{"$f":"IFERROR(VLOOKUP(O58,Raum!$B$1:$E$400,4,TRUE),\"\")","v":""}]
[null,"Gruppe",null,{"$f":"IFERROR(VLOOKUP(C59,Lehrer!$C$1:$N$100,9,TRUE),\"\")","v":""},null,{"$f":"IFERROR(VLOOKUP(E59,Gegenstand!$B$1:$E$400,4,TRUE),\"\")","v":""},"","",null,null,null,null,null,null,null,{"$f":"IFERROR(VLOOKUP(O59,Raum!$B$1:$E$400,4,TRUE),\"\")","v":""}]
[null,"Gruppe",null,{"$f":"IFERROR(VLOOKUP(C60,Lehrer!$C$1:$N$100,9,TRUE),\"\")","v":""},null,{"$f":"IFERROR(VLOOKUP(E60,Gegenstand!$B$1:$E$400,4,TRUE),\"\")","v":""},"","",null,null,null,null,null,null,null,{"$f":"IFERROR(VLOOKUP(O60,Raum!$B$1:$E$400,4,TRUE),\"\")","v":""}]
[null,"Gruppe",null,{"$f":"IFERROR(VLOOKUP(C61,Lehrer!$C$1:$N$100,9,TRUE),\"\")","v":""},null,{"$f":"IFERROR(VLOOKUP(E61,Gegenstand!$B$1:$E$400,4,TRUE),\"\")","v":""},"","",null,null,null,null,null,null,null,{"$f":"IFERROR(VLOOKUP(O61,Raum!$B$1:$E$400,4,TRUE),\"\")","v":""}]
[null,"Gruppe",null,{"$f":"IFERROR(VLOOKUP(C62,Lehrer!$C$1:$N$100,9,TRUE),\"\")","v":""},null,{"$f":"IFERROR(VLOOKUP(E62,Gegenstand!$B$1:$E$400,4,TRUE),\"\")","v":""},"","",null,null,null,null,null,null,null,{"$f":"IFERROR(VLOOKUP(O62,Raum!$B$1:$E$400,4,TRUE),\"\")","v":""}]
[null,"Gruppe",null,{"$f":"IFERROR(VLOOKUP(C63,Lehrer!$C$1:$N$100,9,TRUE),\"\")","v":""},null,{"$f":"IFERROR(VLOOKUP(E63,Gegenstand!$B$1:$E$400,4,TRUE),\"\")","v":""},"","",null,null,null,null,null,null,null,{"$f":"IFERROR(VLOOKUP(O63,Raum!$B$1:$E$400,4,TRUE),\"\")","v":""}]
[null,"Gruppe",null,{"$f":"IFERROR(VLOOKUP(C64,Lehrer!$C$1:$N$100,9,TRUE),\"\")","v":""},null,{"$f":"IFERROR(VLOOKUP(E64,Gegenstand!$B$1:$E$400,4,TRUE),\"\")","v":""},"","",null,null,null,null,null,null,null,{"$f":"IFERROR(VLOOKUP(O64,Raum!$B$1:$E$400,4,TRUE),\"\")","v":""}]
[null,"Gruppe",null,{"$f":"IFERROR(VLOOKUP(C65,Lehrer!$C$1:$N$100,9,TRUE),\"\")","v":""},null,{"$f":"IFERROR(VLOOKUP(E65,Gegenstand!$B$1:$E$400,4,TRUE),\"\")","v":""},"","",null,null,null,null,null,null,null,{"$f":"IFERROR(VLOOKUP(O65,Raum!$B$1:$E$400,4,TRUE),\"\")","v":""}]
[null,"Gruppe",null,{"$f":"IFERROR(VLOOKUP(C66,Lehrer!$C$1:$N$100,9,TRUE),\"\")","v":""},null,{"$f":"IFERROR(VLOOKUP(E66,Gegenstand!$B$1:$E$400,4,TRUE),\"\")","v":""},"","",null,null,null,null,null,null,null,{"$f":"IFERROR(VLOOKUP(O66,Raum!$B$1:$E$400,4,TRUE),\"\")","v":""}]
[null,"Gruppe",null,{"$f":"IFERROR(VLOOKUP(C67,Lehrer!$C$1:$N$100,9,TRUE),\"\")","v":""},null,{"$f":"IFERROR(VLOOKUP(E67,Gegenstand!$B$1:$E$400,4,TRUE),\"\")","v":""},"","",null,null,null,null,null,null,null,{"$f":"IFERROR(VLOOKUP(O67,Raum!$B$1:$E$400,4,TRUE),\"\")","v":""}]
[null,"Gruppe",null,{"$f":"IFERROR(VLOOKUP(C68,Lehrer!$C$1:$N$100,9,TRUE),\"\")","v":""},null,{"$f":"IFERROR(VLOOKUP(E68,Gegenstand!$B$1:$E$400,4,TRUE),\"\")","v":""},{"$f":"IFERROR(LEFT(F68,FIND(\"#\",F68)-1),\"\")","v":""},{"$f":"IFERROR(RIGHT(F68,LEN(F68)-FIND(\"#\",F68)),\"\")","v":""},null,null,null,null,null,null,null,{"$f":"IFERROR(VLOOKUP(O68,Raum!$B$1:$E$400,4,TRUE),\"\")","v":""}]
[null,"Gruppe",null,{"$f":"IFERROR(VLOOKUP(C69,Lehrer!$C$1:$N$100,9,TRUE),\"\")","v":""},null,{"$f":"IFERROR(VLOOKUP(E69,Gegenstand!$B$1:$E$400,4,TRUE),\"\")","v":""},"","",null,null,null,null,null,null,null,{"$f":"IFERROR(VLOOKUP(O69,Raum!$B$1:$E$400,4,TRUE),\"\")","v":""}]
[null,"Gruppe",null,{"$f":"IFERROR(VLOOKUP(C70,Lehrer!$C$1:$N$100,9,TRUE),\"\")","v":""},null,{"$f":"IFERROR(VLOOKUP(E70,Gegenstand!$B$1:$E$400,4,TRUE),\"\")","v":""},"","",null,null,null,null,null,null,null,{"$f":"IFERROR(VLOOKUP(O70,Raum!$B$1:$E$400,4,TRUE),\"\")","v":""}]
[null,"Gruppe",null,{"$f":"IFERROR(VLOOKUP(C71,Lehrer!$C$1:$N$100,9,TRUE),\"\")","v":""},null,{"$f":"IFERROR(VLOOKUP(E71,Gegenstand!$B$1:$E$400,4,TRUE),\"\")","v":""},"","",null,null,null,null,null,null,null,{"$f":"IFERROR(VLOOKUP(O71,Raum!$B$1:$E$400,4,TRUE),\"\")","v":""}]
[null,"Gruppe",null,{"$f":"IFERROR(VLOOKUP(C72,Lehrer!$C$1:$N$100,9,TRUE),\"\")","v":""},null,{"$f":"IFERROR(VLOOKUP(E72,Gegenstand!$B$1:$E$400,4,TRUE),\"\")","v":""},"","",null,null,null,null,null,null,null,{"$f":"IFERROR(VLOOKUP(O72,Raum!$B$1:$E$400,4,TRUE),\"\")","v":""}]
[null,"Gruppe",null,{"$f":"IFERROR(VLOOKUP(C73,Lehrer!$C$1:$N$100,9,TRUE),\"\")","v":""},null,{"$f":"IFERROR(VLOOKUP(E73,Gegenstand!$B$1:$E$400,4,TRUE),\"\")","v":""},"","",null,null,null,null,null,null,null,{"$f":"IFERROR(VLOOKUP(O73,Raum!$B$1:$E$400,4,TRUE),\"\")","v":""}]
[null,"Gruppe",null,{"$f":"IFERROR(VLOOKUP(C74,Lehrer!$C$1:$N$100,9,TRUE),\"\")","v":""},null,{"$f":"IFERROR(VLOOKUP(E74,Gegenstand!$B$1:$E$400,4,TRUE),\"\")","v":""},"","",null,null,null,null,null,null,null,{"$f":"IFERROR(VLOOKUP(O74,Raum!$B$1:$E$400,4,TRUE),\"\")","v":""}]
[null,"Gruppe",null,{"$f":"IFERROR(VLOOKUP(C75,Lehrer!$C$1:$N$100,9,TRUE),\"\")","v":""},null,{"$f":"IFERROR(VLOOKUP(E75,Gegenstand!$B$1:$E$400,4,TRUE),\"\")","v":""},"","",null,null,null,null,null,null,null,{"$f":"IFERROR(VLOOKUP(O75,Raum!$B$1:$E$400,4,TRUE),\"\")","v":""}]
[null,"Gruppe",null,{"$f":"IFERROR(VLOOKUP(C76,Lehrer!$C$1:$N$100,9,TRUE),\"\")","v":""},null,{"$f":"IFERROR(VLOOKUP(E76,Gegenstand!$B$1:$E$400,4,TRUE),\"\")","v":""},"","",null,null,null,null,null,null,null,{"$f":"IFERROR(VLOOKUP(O76,Raum!$B$1:$E$400,4,TRUE),\"\")","v":""}]
[null,"Gruppe",null,{"$f":"IFERROR(VLOOKUP(C77,Lehrer!$C$1:$N$100,9,TRUE),\"\")","v":""},null,{"$f":"IFERROR(VLOOKUP(E77,Gegenstand!$B$1:$E$400,4,TRUE),\"\")","v":""},"","",null,null,null,null,null,null,null,{"$f":"IFERROR(VLOOKUP(O77,Raum!$B$1:$E$400,4,TRUE),\"\")","v":""}]
[null,"Gruppe",null,{"$f":"IFERROR(VLOOKUP(C78,Lehrer!$C$1:$N$100,9,TRUE),\"\")","v":""},null,{"$f":"IFERROR(VLOOKUP(E78,Gegenstand!$B$1:$E$400,4,TRUE),\"\")","v":""},"","",null,null,null,null,null,null,null,{"$f":"IFERROR(VLOOKUP(O78,Raum!$B$1:$E$400,4,TRUE),\"\")","v":""}]
[null,"Gruppe",null,{"$f":"IFERROR(VLOOKUP(C79,Lehrer!$C$1:$N$100,9,TRUE),\"\")","v":""},null,{"$f":"IFERROR(VLOOKUP(E79,Gegenstand!$B$1:$E$400,4,TRUE),\"\")","v":""},"","",null,null,null,null,null,null,null,{"$f":"IFERROR(VLOOKUP(O79,Raum!$B$1:$E$400,4,TRUE),\"\")","v":""}]
[null,"Gruppe",null,{"$f":"IFERROR(VLOOKUP(C80,Lehrer!$C$1:$N$100,9,TRUE),\"\")","v":""},null,{"$f":"IFERROR(VLOOKUP(E80,Gegenstand!$B$1:$E$400,4,TRUE),\"\")","v":""},"","",null,null,null,null,null,null,null,{"$f":"IFERROR(VLOOKUP(O80,Raum!$B$1:$E$400,4,TRUE),\"\")","v":""}]
{"$rows_left_out":222}
{"sheet":"Gegenstand","index":1,"n_rows":0,"n_cols":0,"rows_kept":0,"cut":false,"hidden":true,"merged":[]}

{"sheet":"Klasse","index":2,"n_rows":0,"n_cols":0,"rows_kept":0,"cut":false,"hidden":true,"merged":[]}

{"sheet":"Raum","index":3,"n_rows":6,"n_cols":5,"rows_kept":6,"cut":false,"hidden":true,"merged":[]}
["RM","EDV1","EDV 1",null,1447]
["RM","EDV2","EDV 2",null,1448]
["RM","KREA","Kreativwerkstätte",null,1449]
["RM","KÜ","Küche",null,1450]
["RM","MR","Medienraum",null,1461]
["RM","PS1","Klasse 1",null,1451]

{"sheet":"Lehrer","index":4,"n_rows":12,"n_cols":1,"rows_kept":12,"cut":false,"hidden":true,"merged":[]}
["TE"]
["TE"]
["TE"]
["TE"]
["TE"]
["TE"]
["TE"]
["TE"]
["TE"]
["TE"]
["TE"]
["TE"]

{"sheet":"Datum","index":5,"n_rows":1,"n_cols":2,"rows_kept":1,"cut":false,"hidden":true,"merged":[]}
["12.09.2016","07.07.2017"]